id,name,charityNumber,companyNumber,postalCode,url,latestIncome,latestIncomeDate,dateRegistered,dateRemoved,active,dateModified,orgIDs,linked_orgs,organisationType,organisationTypePrimary,source
GB-SC-SC000024,Age Concern Kirkcaldy,SC000024,,KY1 2LY,,2348,2019-03-31,1971-04-22,2019-09-27,False,2024-07-04 20:02:29.801198+00:00,['GB-SC-SC000024'],['GB-SC-SC000024'],"['registered-charity', 'registered-charity-scotland', 'unincorporated-association']",Registered Charity,oscr
GB-SC-SC000025,Simon's Strays,SC000025,,AA1 8AA,https://www.simonsstrays.com,,,1992-01-01,2022-11-08,False,2024-07-04 20:02:29.801415+00:00,['GB-SC-SC000025'],['GB-SC-SC000025'],"['registered-charity', 'registered-charity-scotland', 'unincorporated-association']",Registered Charity,oscr
GB-SC-SC000027,Grangemouth Council Of Churches,SC000027,,FK2 0QB,,4303,2015-12-31,1976-02-24,2017-09-26,False,2024-07-04 20:02:29.801855+00:00,['GB-SC-SC000027'],['GB-SC-SC000027'],"['registered-charity', 'registered-charity-scotland', 'unincorporated-association']",Registered Charity,oscr
GB-SC-SC000052,Meadowbank Church of Scotland Edinburgh,SC000052,,EH5 3EQ,http://Meadowbank@Meadowbankchurch.com,43377,2022-12-31,1915-11-16,2023-09-08,False,2024-07-04 20:02:29.804981+00:00,['GB-SC-SC000052'],['GB-SC-SC000052'],"['registered-charity', 'registered-charity-scotland', 'unincorporated-association']",Registered Charity,oscr
GB-SC-SC000059,Gylemuir Playgroup,SC000059,,EH12 7RT,,,,1992-01-01,2012-06-02,False,2024-07-04 20:02:29.806131+00:00,['GB-SC-SC000059'],['GB-SC-SC000059'],"['registered-charity', 'registered-charity-scotland', 'unincorporated-association']",Registered Charity,oscr
GB-SC-SC000072,Bell Baxter High School 'Fund Fair' Fund,SC000072,,KY15 4HY,,123,2017-03-31,1982-03-03,2018-02-02,False,2024-07-04 20:02:29.808228+00:00,['GB-SC-SC000072'],['GB-SC-SC000072'],"['registered-charity', 'registered-charity-scotland', 'unincorporated-association']",Registered Charity,oscr
GB-SC-SC000076,Braidfield School Fund,SC000076,,G81 2LR,,,,1992-01-01,2012-06-02,False,2024-07-04 20:02:29.809118+00:00,['GB-SC-SC000076'],['GB-SC-SC000076'],"['registered-charity', 'registered-charity-scotland', 'unincorporated-association']",Registered Charity,oscr
GB-SC-SC000088,St Luke's And Queen Street Church Of Scotland: Broughty Ferry,SC000088,,DD5 1AE,,42658,2022-12-31,1915-02-19,2024-01-11,False,2024-07-04 20:02:29.811272+00:00,['GB-SC-SC000088'],['GB-SC-SC000088'],"['registered-charity', 'registered-charity-scotland', 'unincorporated-association']",Registered Charity,oscr
GB-SC-SC000090,Huntly Stroke Club,SC000090,,AB54 8PZ,,386,2022-03-31,1992-01-01,2023-03-22,False,2024-07-04 20:02:29.811705+00:00,['GB-SC-SC000090'],['GB-SC-SC000090'],"['registered-charity', 'registered-charity-scotland', 'unincorporated-association']",Registered Charity,oscr
GB-SC-SC000128,Cults Academy School Fund,SC000128,,AB1 9SA,,,,1992-01-01,2012-06-02,False,2024-07-04 20:02:29.817361+00:00,['GB-SC-SC000128'],['GB-SC-SC000128'],"['registered-charity', 'registered-charity-scotland', 'unincorporated-association']",Registered Charity,oscr
GB-SC-SC000137,Church Of God: Peterculter,SC000137,,AB14 0RJ,,9883,2007-12-31,1992-01-01,2012-06-02,False,2024-07-04 20:02:29.818241+00:00,['GB-SC-SC000137'],['GB-SC-SC000137'],"['registered-charity', 'registered-charity-scotland', 'unincorporated-association']",Registered Charity,oscr
GB-SC-SC000145,Whalsay Disability & Special Needs Support Group,SC000145,,ZE2 9AL,,27041,2016-09-30,1989-04-14,2018-04-05,False,2024-07-04 20:02:29.819317+00:00,['GB-SC-SC000145'],['GB-SC-SC000145'],"['registered-charity', 'registered-charity-scotland', 'unincorporated-association']",Registered Charity,oscr
GB-SC-SC000164,Assemblies Of God Peterhead,SC000164,,AB42 1LN,,0,2016-03-31,1987-08-09,2017-11-02,False,2024-07-04 20:02:29.822585+00:00,['GB-SC-SC000164'],['GB-SC-SC000164'],"['registered-charity', 'registered-charity-scotland', 'unincorporated-association']",Registered Charity,oscr
GB-SC-SC000169,Ian D K Stuart's Memorial Fund,SC000169,,PA16 0BF,,1800,2009-04-05,1953-02-16,2018-11-16,False,2024-07-04 20:02:29.823666+00:00,['GB-SC-SC000169'],['GB-SC-SC000169'],"['registered-charity', 'registered-charity-scotland', 'unincorporated-association']",Registered Charity,oscr
GB-SC-SC000183,Alloway Community Playgroup,SC000183,,KA7 4PW,,0,2007-07-31,1992-01-01,2012-06-02,False,2024-07-04 20:02:29.826036+00:00,['GB-SC-SC000183'],['GB-SC-SC000183'],"['registered-charity', 'registered-charity-scotland', 'unincorporated-association']",Registered Charity,oscr
GB-SC-SC000186,Aberdour Playgroup,SC000186,,KY3 0TR,http://www.aberdourplaygroup.org,40016,2020-11-30,1969-10-22,2021-09-02,False,2024-07-04 20:02:29.826681+00:00,['GB-SC-SC000186'],['GB-SC-SC000186'],"['registered-charity', 'registered-charity-scotland', 'unincorporated-association']",Registered Charity,oscr
GB-SC-SC000193,Perth Cathedral Operatic Group,SC000193,,PH1 3JJ,http://www.perthcog.co.uk,0,2021-12-31,1987-06-03,2023-12-22,False,2024-07-04 20:02:29.827978+00:00,['GB-SC-SC000193'],['GB-SC-SC000193'],"['registered-charity', 'registered-charity-scotland', 'unincorporated-association']",Registered Charity,oscr
GB-SC-SC000194,Burghead Mother & Toddler Group,SC000194,,IV30 5HA,,801,2009-04-30,1986-05-27,2018-12-07,False,2024-07-04 20:02:29.828195+00:00,['GB-SC-SC000194'],['GB-SC-SC000194'],"['registered-charity', 'registered-charity-scotland', 'unincorporated-association']",Registered Charity,oscr
GB-SC-SC000207,Edinburgh University Savoy Opera Group,SC000207,,EH8 9AL,http://www.eusog.org,22789,2018-05-15,1992-01-01,2019-06-10,False,2024-07-04 20:02:29.829707+00:00,['GB-SC-SC000207'],['GB-SC-SC000207'],"['registered-charity', 'registered-charity-scotland', 'unincorporated-association']",Registered Charity,oscr
GB-SC-SC000219,St Mary's Community Church,SC000219,,PH13 9JF,,19966,2022-05-31,1992-01-01,2023-11-21,False,2024-07-04 20:02:29.830782+00:00,['GB-SC-SC000219'],['GB-SC-SC000219'],"['registered-charity', 'registered-charity-scotland', 'unincorporated-association']",Registered Charity,oscr
GB-SC-SC000234,Jack & Jill Playgroup - Oban,SC000234,,PA34 4HY,,5331,2009-03-31,1988-09-27,2012-06-02,False,2024-07-04 20:02:29.833165+00:00,['GB-SC-SC000234'],['GB-SC-SC000234'],"['registered-charity', 'registered-charity-scotland', 'unincorporated-association']",Registered Charity,oscr
GB-SC-SC000244,Tempo Musical Productions,SC000244,,EH42 1GR,http://www.tempo.org.uk,0,2018-03-31,1990-08-20,2019-04-30,False,2024-07-04 20:02:29.834021+00:00,['GB-SC-SC000244'],['GB-SC-SC000244'],"['registered-charity', 'registered-charity-scotland', 'unincorporated-association']",Registered Charity,oscr
GB-SC-SC000245,Boyndie Kirk Session For Various Bequests,SC000245,,AB45 2NE,,11330,2007-12-31,1992-01-01,2012-06-02,False,2024-07-04 20:02:29.834236+00:00,['GB-SC-SC000245'],['GB-SC-SC000245'],"['registered-charity', 'registered-charity-scotland', 'unincorporated-association']",Registered Charity,oscr
GB-SC-SC000246,Bonkyl And Edrom Church Of Scotland,SC000246,,TD11 3DE,,8970,2013-12-31,1990-03-21,2015-01-10,False,2024-07-04 20:02:29.834451+00:00,['GB-SC-SC000246'],['GB-SC-SC000246'],"['registered-charity', 'registered-charity-scotland', 'unincorporated-association']",Registered Charity,oscr
GB-SC-SC000253,Dundee Sailors Home & Hostel,SC000253,,DD1 4QB,,13579,2023-12-31,1962-10-24,2024-06-25,False,2024-07-04 20:02:29.835781+00:00,['GB-SC-SC000253'],['GB-SC-SC000253'],"['registered-charity', 'registered-charity-scotland', 'unincorporated-association']",Registered Charity,oscr
GB-SC-SC000265,Garelochhead Mother & Under Fives Group,SC000265,,G84 0DZ,,407,2012-03-31,1980-05-20,2013-09-27,False,2024-07-04 20:02:29.837510+00:00,['GB-SC-SC000265'],['GB-SC-SC000265'],"['registered-charity', 'registered-charity-scotland', 'unincorporated-association']",Registered Charity,oscr
GB-SC-SC000279,Orchardhill Mother & Toddler Group,SC000279,, G46,,,,1992-01-01,2012-06-02,False,2024-07-04 20:02:29.838594+00:00,['GB-SC-SC000279'],['GB-SC-SC000279'],"['registered-charity', 'registered-charity-scotland', 'unincorporated-association']",Registered Charity,oscr
GB-SC-SC000281,St Johns Church Of Scotland: Galashiels,SC000281,,TD6 0DH,https://stjohnschurchgalashiels.uk/,48717,2019-12-31,1950-02-08,2021-06-29,False,2024-07-04 20:02:29.839026+00:00,['GB-SC-SC000281'],['GB-SC-SC000281'],"['registered-charity', 'registered-charity-scotland', 'unincorporated-association']",Registered Charity,oscr
GB-SC-SC000287,Dundee Indigent Sick Society,SC000287,,DD1 1RJ,,1014,2012-04-19,1898-02-26,2012-06-02,False,2024-07-04 20:02:29.839699+00:00,['GB-SC-SC000287'],['GB-SC-SC000287'],"['registered-charity', 'registered-charity-scotland', 'unincorporated-association']",Registered Charity,oscr
GB-SC-SC000292,Knockbreck Nursery and Playgroup,SC000292,,IV19 1EU,,31290,2006-07-31,1992-01-01,2012-06-02,False,2024-07-04 20:02:29.840626+00:00,['GB-SC-SC000292'],['GB-SC-SC000292'],"['registered-charity', 'registered-charity-scotland', 'unincorporated-association']",Registered Charity,oscr
GB-SC-SC000311,Central Baptist Church,SC000311,,DD1 1LP,http://centraldundee.com,567556,2021-12-31,1909-08-18,2023-02-27,False,2024-07-04 20:02:29.841767+00:00,['GB-SC-SC000311'],['GB-SC-SC000311'],"['registered-charity', 'registered-charity-scotland', 'unincorporated-association']",Registered Charity,oscr
GB-SC-SC000314,Riccarton Playgroup,SC000314,,EH14 5PU,,47837,2019-08-31,1983-03-01,2021-02-17,False,2024-07-04 20:02:29.842006+00:00,['GB-SC-SC000314'],['GB-SC-SC000314'],"['registered-charity', 'registered-charity-scotland', 'unincorporated-association']",Registered Charity,oscr
GB-SC-SC000316,Dundee: Whitfield Parish Church of Scotland,SC000316,,DD4 0NA,,45966,2022-12-31,1973-06-07,2024-01-10,False,2024-07-04 20:02:29.842221+00:00,['GB-SC-SC000316'],['GB-SC-SC000316'],"['registered-charity', 'registered-charity-scotland', 'unincorporated-association']",Registered Charity,oscr
GB-SC-SC000322,Cellardyke Town Hall Management Committee,SC000322,,KY10 3AS,,14839,2014-03-31,1989-08-16,2015-09-03,False,2024-07-04 20:02:29.843548+00:00,['GB-SC-SC000322'],['GB-SC-SC000322'],"['registered-charity', 'registered-charity-scotland', 'unincorporated-association']",Registered Charity,oscr
GB-SC-SC000349,Commercial Travellers Of Scotland Benevolent Fund For Widows And Orphans,SC000349,,EH9 2AB,http://www.ctosbenevolentfund.org.uk,18825,2008-12-01,1905-12-15,2012-06-02,False,2024-07-04 20:02:29.847943+00:00,['GB-SC-SC000349'],['GB-SC-SC000349'],"['registered-charity', 'registered-charity-scotland', 'unincorporated-association']",Registered Charity,oscr
GB-SC-SC000366,Royal Highland Fusiliers Regimental Trust Fund,SC000366,,G2 4TP,,0,2020-03-31,1946-07-30,2021-01-14,False,2024-07-04 20:02:29.849919+00:00,['GB-SC-SC000366'],['GB-SC-SC000366'],"['registered-charity', 'registered-charity-scotland', 'unincorporated-association']",Registered Charity,oscr
GB-SC-SC000370,Dalmally Village Hall,SC000370,,PA33 1AS,,1418,2010-03-31,1968-03-11,2012-06-02,False,2024-07-04 20:02:29.850778+00:00,['GB-SC-SC000370'],['GB-SC-SC000370'],"['registered-charity', 'registered-charity-scotland', 'unincorporated-association']",Registered Charity,oscr
GB-SC-SC000372,Merkinch Tots,SC000372,,IV3 8AD,,186,2011-03-31,1983-06-10,2013-02-25,False,2024-07-04 20:02:29.850995+00:00,['GB-SC-SC000372'],['GB-SC-SC000372'],"['registered-charity', 'registered-charity-scotland', 'unincorporated-association']",Registered Charity,oscr
GB-SC-SC000375,Inverallochy & Rathen East Parish Church Of Scotland,SC000375,,AB42 1GY,,16054,2022-12-31,1944-09-20,2024-07-02,False,2024-07-04 20:02:29.851692+00:00,['GB-SC-SC000375'],['GB-SC-SC000375'],"['registered-charity', 'registered-charity-scotland', 'unincorporated-association']",Registered Charity,oscr
GB-SC-SC000384,Stobswell Parish Church Of Scotland: Dundee,SC000384,,DD5 3PA,,55940,2021-12-31,1922-06-13,2023-01-13,False,2024-07-04 20:02:29.853464+00:00,['GB-SC-SC000384'],['GB-SC-SC000384'],"['registered-charity', 'registered-charity-scotland', 'unincorporated-association']",Registered Charity,oscr
GB-SC-SC000387,The Ayrshire Member's Centre the National Trust for Scotland,SC000387,,KA7 2QG,http://www.ntsayrshire.org.uk,2,2022-04-30,1983-02-14,2022-10-26,False,2024-07-04 20:02:29.853680+00:00,['GB-SC-SC000387'],['GB-SC-SC000387'],"['registered-charity', 'registered-charity-scotland', 'unincorporated-association']",Registered Charity,oscr
GB-SC-SC000400,Help Or Rehabilitate Scottish Equines - Horse,SC000400,,AB53 8JJ,,609,2011-05-31,1990-05-20,2017-02-15,False,2024-07-04 20:02:29.855784+00:00,['GB-SC-SC000400'],['GB-SC-SC000400'],"['registered-charity', 'registered-charity-scotland', 'unincorporated-association']",Registered Charity,oscr
GB-SC-SC000402,Pentland Community Education Centre Association,SC000402,,EH13 9LS,http://www.pentlandcommunitycentre.com,20386,2018-03-31,1978-12-13,2019-07-18,False,2024-07-04 20:02:29.856242+00:00,['GB-SC-SC000402'],['GB-SC-SC000402'],"['registered-charity', 'registered-charity-scotland', 'unincorporated-association']",Registered Charity,oscr
GB-SC-SC000405,Scots College Rome Fund,SC000405,,ML6 6LT,,,,1992-01-01,2012-06-02,False,2024-07-04 20:02:29.856473+00:00,['GB-SC-SC000405'],['GB-SC-SC000405'],"['registered-charity', 'registered-charity-scotland', 'unincorporated-association']",Registered Charity,oscr
GB-SC-SC000417,St Cyrus Gala Comm,SC000417,,DD10 0DZ,,4562,2007-08-31,1992-01-01,2012-06-02,False,2024-07-04 20:02:29.857780+00:00,['GB-SC-SC000417'],['GB-SC-SC000417'],"['registered-charity', 'registered-charity-scotland', 'unincorporated-association']",Registered Charity,oscr
GB-SC-SC000450,Humpty Dumpty Playgroup,SC000450,,KY7 6RU,,,,1992-01-01,2012-06-02,False,2024-07-04 20:02:29.862794+00:00,['GB-SC-SC000450'],['GB-SC-SC000450'],"['registered-charity', 'registered-charity-scotland', 'unincorporated-association']",Registered Charity,oscr
GB-SC-SC000461,Westray United Free Church,SC000461,,KW17 2DN,,13079,2009-12-31,1978-04-27,2012-06-02,False,2024-07-04 20:02:29.864159+00:00,['GB-SC-SC000461'],['GB-SC-SC000461'],"['registered-charity', 'registered-charity-scotland', 'unincorporated-association']",Registered Charity,oscr
GB-SC-SC000462,Springfield Community Education Association,SC000462,,EH49 7SN,,9870,2017-03-31,1981-11-30,2024-05-20,False,2024-07-04 20:02:29.864390+00:00,['GB-SC-SC000462'],['GB-SC-SC000462'],"['registered-charity', 'registered-charity-scotland', 'unincorporated-association']",Registered Charity,oscr
GB-SC-SC000467,Kelso Mother & Toddler Group,SC000467,,TD5 7JP,,1381,2009-09-08,1982-02-11,2012-06-02,False,2024-07-04 20:02:29.865485+00:00,['GB-SC-SC000467'],['GB-SC-SC000467'],"['registered-charity', 'registered-charity-scotland', 'unincorporated-association']",Registered Charity,oscr
GB-SC-SC000478,Dr Spence Memorial Hall & Dr Spence Memorial Hall Endowment Fund,SC000478,,AB41 6ST,,127,2008-04-05,1992-01-01,2012-06-02,False,2024-07-04 20:02:29.866773+00:00,['GB-SC-SC000478'],['GB-SC-SC000478'],"['registered-charity', 'registered-charity-scotland', 'unincorporated-association']",Registered Charity,oscr
GB-SC-SC000479,Portmahomack & District Community Assoc,SC000479,,IV20 1YH,,551,2009-04-30,1984-04-26,2016-12-29,False,2024-07-04 20:02:29.866991+00:00,['GB-SC-SC000479'],['GB-SC-SC000479'],"['registered-charity', 'registered-charity-scotland', 'unincorporated-association']",Registered Charity,oscr
GB-SC-SC000494,Whitekirk and Tyninghame Parish Church (Church of Scotland),SC000494,,EH10 6LE,http://www.whitekirkvillage.com/church.html,25569,2020-12-31,1957-02-08,2021-05-12,False,2024-07-04 20:02:29.869444+00:00,['GB-SC-SC000494'],['GB-SC-SC000494'],"['registered-charity', 'registered-charity-scotland', 'unincorporated-association']",Registered Charity,oscr
GB-SC-SC000498,Balmaghie Church of Scotland,SC000498,,DG7 2PW,,15477,2013-12-31,1945-10-12,2015-08-04,False,2024-07-04 20:02:29.870094+00:00,['GB-SC-SC000498'],['GB-SC-SC000498'],"['registered-charity', 'registered-charity-scotland', 'unincorporated-association']",Registered Charity,oscr
GB-SC-SC000505,Assynt Mountain Rescue Organisation,SC000505,,IV26 2TP,http://www.assyntmountainrescue.co.uk,74213,2018-12-31,1981-03-04,2019-10-04,False,2024-07-04 20:02:29.871017+00:00,['GB-SC-SC000505'],['GB-SC-SC000505'],"['registered-charity', 'registered-charity-scotland', 'unincorporated-association']",Registered Charity,oscr
GB-SC-SC000508,League Of Friends Of The Lady Margaret Hospital,SC000508,,KA28 0EA,,827,2018-02-28,1989-05-24,2019-07-04,False,2024-07-04 20:02:29.871735+00:00,['GB-SC-SC000508'],['GB-SC-SC000508'],"['registered-charity', 'registered-charity-scotland', 'unincorporated-association']",Registered Charity,oscr
GB-SC-SC000526,Scottish Christian Endeavour Alumni Assoc,SC000526,,PA2 6QR,,740,2010-12-31,1957-11-05,2012-06-02,False,2024-07-04 20:02:29.874620+00:00,['GB-SC-SC000526'],['GB-SC-SC000526'],"['registered-charity', 'registered-charity-scotland', 'unincorporated-association']",Registered Charity,oscr
GB-SC-SC000532,"Carmyle Church of Scotland, Glasgow",SC000532,,G32 9NT,http://www.carmylechurch.co.uk,25161,2022-12-31,1953-07-03,2024-03-01,False,2024-07-04 20:02:29.875496+00:00,['GB-SC-SC000532'],['GB-SC-SC000532'],"['registered-charity', 'registered-charity-scotland', 'unincorporated-association']",Registered Charity,oscr
GB-SC-SC000568,Oxton Playgroup,SC000568,,TD2 6RB,,,,1992-01-01,2012-06-02,False,2024-07-04 20:02:29.880846+00:00,['GB-SC-SC000568'],['GB-SC-SC000568'],"['registered-charity', 'registered-charity-scotland', 'unincorporated-association']",Registered Charity,oscr
GB-SC-SC000572,Dun and Hillside Church Of Scotland,SC000572,,DD10 9TJ,,59496,2021-12-31,1917-02-21,2023-08-07,False,2024-07-04 20:02:29.881490+00:00,['GB-SC-SC000572'],['GB-SC-SC000572'],"['registered-charity', 'registered-charity-scotland', 'unincorporated-association']",Registered Charity,oscr
GB-SC-SC000575,Newtown Church Of Scotland,SC000575,,TD6 0QH,,23753,2020-12-31,1992-01-01,2021-06-29,False,2024-07-04 20:02:29.882137+00:00,['GB-SC-SC000575'],['GB-SC-SC000575'],"['registered-charity', 'registered-charity-scotland', 'unincorporated-association']",Registered Charity,oscr
GB-SC-SC000587,Samaritans Of Kirkcaldy & District,SC000587,,KT17 2AF,,0,2020-03-31,1985-12-06,2021-11-12,False,2024-07-04 20:02:29.883662+00:00,['GB-SC-SC000587'],['GB-SC-SC000587'],"['registered-charity', 'registered-charity-scotland', 'unincorporated-association']",Registered Charity,oscr
GB-SC-SC000588,Westwood Baptist Church,SC000588,,G75 8EY,http://www.wwbc.co.uk,83691,2021-08-31,1990-02-14,2022-11-03,False,2024-07-04 20:02:29.883879+00:00,['GB-SC-SC000588'],['GB-SC-SC000588'],"['registered-charity', 'registered-charity-scotland', 'unincorporated-association']",Registered Charity,oscr
GB-SC-SC000590,Pitlochry Benevolent Trust,SC000590,,PH16 5EP,,75,2015-11-30,1961-01-27,2016-06-22,False,2024-07-04 20:02:29.884312+00:00,['GB-SC-SC000590'],['GB-SC-SC000590'],"['registered-charity', 'registered-charity-scotland', 'unincorporated-association']",Registered Charity,oscr
GB-SC-SC000592,Drongan Miners Charitable Society,SC000592,,KA6 7AZ,,0,2012-01-31,1967-04-03,2017-03-08,False,2024-07-04 20:02:29.884744+00:00,['GB-SC-SC000592'],['GB-SC-SC000592'],"['registered-charity', 'registered-charity-scotland', 'unincorporated-association']",Registered Charity,oscr
GB-SC-SC000604,Kilmallie Hall,SC000604,,PH33 7JH,,0,2016-01-31,1970-03-16,2017-08-03,False,2024-07-04 20:02:29.886476+00:00,['GB-SC-SC000604'],['GB-SC-SC000604'],"['registered-charity', 'registered-charity-scotland', 'unincorporated-association']",Registered Charity,oscr
GB-SC-SC000613,Croileagan Scalpaigh,SC000613,,IV1 1DR,,5097,2008-01-31,1992-01-01,2012-06-02,False,2024-07-04 20:02:29.887555+00:00,['GB-SC-SC000613'],['GB-SC-SC000613'],"['registered-charity', 'registered-charity-scotland', 'unincorporated-association']",Registered Charity,oscr
GB-SC-SC000614,Boys and Girls Clubs Scotwest,SC000614,,KA3 2GA,http://www.boysandgirlsclubsscotwest.co.uk,2550,2017-08-31,1992-01-01,2019-04-04,False,2024-07-04 20:02:29.887772+00:00,['GB-SC-SC000614'],['GB-SC-SC000614'],"['registered-charity', 'registered-charity-scotland', 'unincorporated-association']",Registered Charity,oscr
GB-SC-SC000621,Be Well,SC000621,,EH16 4UL,http://www.be-well.org.uk,35421,2007-03-31,1992-01-01,2013-05-01,False,2024-07-04 20:02:29.888638+00:00,['GB-SC-SC000621'],['GB-SC-SC000621'],"['registered-charity', 'registered-charity-scotland', 'unincorporated-association']",Registered Charity,oscr
GB-SC-SC000626,Reid : Miss Reid & Mrs Robertson Bequests- Rutherglen Old Parish Church,SC000626,,G73 3DB,,,,1992-01-01,2012-06-02,False,2024-07-04 20:02:29.889720+00:00,['GB-SC-SC000626'],['GB-SC-SC000626'],"['registered-charity', 'registered-charity-scotland', 'unincorporated-association']",Registered Charity,oscr
GB-SC-SC000627,St Peters Under 5's Group,SC000627,,TD1 3JX,,278,2015-05-14,1987-06-10,2016-03-23,False,2024-07-04 20:02:29.889939+00:00,['GB-SC-SC000627'],['GB-SC-SC000627'],"['registered-charity', 'registered-charity-scotland', 'unincorporated-association']",Registered Charity,oscr
GB-SC-SC000634,Rotary Club Of Kilwinning Benevolent Fund,SC000634,,KA13 7NL,,2,2018-06-30,1978-09-05,2019-11-01,False,2024-07-04 20:02:29.891240+00:00,['GB-SC-SC000634'],['GB-SC-SC000634'],"['registered-charity', 'registered-charity-scotland', 'unincorporated-association']",Registered Charity,oscr
GB-SC-SC000668,Avonlea Youth Centre,SC000668,,KA5 6SQ,,999,2009-10-31,1981-04-28,2018-11-02,False,2024-07-04 20:02:29.897191+00:00,['GB-SC-SC000668'],['GB-SC-SC000668'],"['registered-charity', 'registered-charity-scotland', 'unincorporated-association']",Registered Charity,oscr
GB-SC-SC000669,Sutherland (Cleish) Bequest,SC000669,,PH1 5PH,,55,2012-03-31,1992-01-01,2013-08-26,False,2024-07-04 20:02:29.897407+00:00,['GB-SC-SC000669'],['GB-SC-SC000669'],"['registered-charity', 'registered-charity-scotland', 'unincorporated-association']",Registered Charity,oscr
GB-SC-SC000673,Vallance Trust,SC000673,,KA18 4LL,,,,1992-01-01,2012-06-02,False,2024-07-04 20:02:29.897835+00:00,['GB-SC-SC000673'],['GB-SC-SC000673'],"['registered-charity', 'registered-charity-scotland', 'unincorporated-association']",Registered Charity,oscr
GB-SC-SC000690,Kirriemuir Old Parish Church Of Scotland Sunday School Funds,SC000690,,DD8 4DJ,,,,1992-01-01,2012-06-02,False,2024-07-04 20:02:29.899997+00:00,['GB-SC-SC000690'],['GB-SC-SC000690'],"['registered-charity', 'registered-charity-scotland', 'unincorporated-association']",Registered Charity,oscr
GB-SC-SC000705,Scottish Family Planning Medical Society,SC000705,,XX0 0XX,,,,1992-01-01,2012-06-02,False,2024-07-04 20:02:29.902144+00:00,['GB-SC-SC000705'],['GB-SC-SC000705'],"['registered-charity', 'registered-charity-scotland', 'unincorporated-association']",Registered Charity,oscr
GB-SC-SC000707,Catholic Media Office,SC000707,,G1 2DH,http://www.scmo.org,,,1992-01-01,2012-06-02,False,2024-07-04 20:02:29.902362+00:00,['GB-SC-SC000707'],['GB-SC-SC000707'],"['registered-charity', 'registered-charity-scotland', 'unincorporated-association']",Registered Charity,oscr
GB-SC-SC000715,Newmains Primary School Fund,SC000715,,PA4 0DA,,,,1992-01-01,2012-06-02,False,2024-07-04 20:02:29.903444+00:00,['GB-SC-SC000715'],['GB-SC-SC000715'],"['registered-charity', 'registered-charity-scotland', 'unincorporated-association']",Registered Charity,oscr
GB-SC-SC000782,Bingham & District 50+ Project,SC000782,,EH15 3HZ,,0,2020-03-31,1988-08-11,2023-08-04,False,2024-07-04 20:02:29.913518+00:00,['GB-SC-SC000782'],['GB-SC-SC000782'],"['registered-charity', 'registered-charity-scotland', 'unincorporated-association']",Registered Charity,oscr